TAP Matrix - Tue Jul 25 03:12:54 2006 GMT
--- 
build_info: "Summary of my perl5 (revision 5 version 8 subversion 8) configuration:\n  Platform:\n    osname=freebsd, osvers=6.1-stable, archname=i386-freebsd-64int\n    uname='freebsd ab.clkao.org 6.1-stable freebsd 6.1-stable #0: sun jun 4 15:50:51 edt 2006 clkao@ab.clkao.org:usrobjusrsrcsysab i386 '\n    config_args='-sde -Dprefix=/usr/local -Darchlib=/usr/local/lib/perl5/5.8.8/mach -Dprivlib=/usr/local/lib/perl5/5.8.8 -Dman3dir=/usr/local/lib/perl5/5.8.8/perl/man/man3 -Dman1dir=/usr/local/man/man1 -Dsitearch=/usr/local/lib/perl5/site_perl/5.8.8/mach -Dsitelib=/usr/local/lib/perl5/site_perl/5.8.8 -Dscriptdir=/usr/local/bin -Dsiteman3dir=/usr/local/lib/perl5/5.8.8/man/man3 -Dsiteman1dir=/usr/local/man/man1 -Ui_malloc -Ui_iconv -Uinstallusrbinperl -Dcc=cc -Duseshrplib -Dccflags=-DAPPLLIB_EXP=\"/usr/local/lib/perl5/5.8.8/BSDPAN\" -Doptimize=-pipe -O -march=pentium4 -Ud_dosuid -Ui_gdbm -Dusethreads=n -Dusemymalloc=y -Duse64bitint'\n    hint=recommended, useposix=true, d_sigaction=define\n    usethreads=undef use5005threads=undef useithreads=undef usemultiplicity=undef\n    useperlio=define d_sfio=undef uselargefiles=define usesocks=undef\n    use64bitint=define use64bitall=undef uselongdouble=undef\n    usemymalloc=y, bincompat5005=undef\n  Compiler:\n    cc='cc', ccflags ='-DAPPLLIB_EXP=\"/usr/local/lib/perl5/5.8.8/BSDPAN\" -DHAS_FPSETMASK -DHAS_FLOATINGPOINT_H -fno-strict-aliasing -pipe -Wdeclaration-after-statement -I/usr/local/include',\n    optimize='-pipe -O -march=pentium4',\n    cppflags='-DAPPLLIB_EXP=\"/usr/local/lib/perl5/5.8.8/BSDPAN\" -DHAS_FPSETMASK -DHAS_FLOATINGPOINT_H -fno-strict-aliasing -pipe -Wdeclaration-after-statement -I/usr/local/include'\n    ccversion='', gccversion='3.4.4 [FreeBSD] 20050518', gccosandvers=''\n    intsize=4, longsize=4, ptrsize=4, doublesize=8, byteorder=12345678\n    d_longlong=define, longlongsize=8, d_longdbl=define, longdblsize=12\n    ivtype='long long', ivsize=8, nvtype='double', nvsize=8, Off_t='off_t', lseeksize=8\n    alignbytes=4, prototype=define\n  Linker and Libraries:\n    ld='cc', ldflags =' -Wl,-E -L/usr/local/lib'\n    libpth=/usr/lib /usr/local/lib\n    libs=-lm -lcrypt -lutil\n    perllibs=-lm -lcrypt -lutil\n    libc=, so=so, useshrplib=true, libperl=libperl.so\n    gnulibc_version=''\n  Dynamic Linking:\n    dlsrc=dl_dlopen.xs, dlext=so, d_dlsymun=undef, ccdlflags='  -Wl,-R/usr/local/lib/perl5/5.8.8/mach/CORE'\n    cccdlflags='-DPIC -fPIC', lddlflags='-shared  -L/usr/local/lib'\n\n\n\
  Characteristics of this binary (from libperl): \n  Compile-time options: MYMALLOC PERL_MALLOC_WRAP USE_64_BIT_INT\n                        USE_LARGE_FILES USE_PERLIO\n  Locally applied patches:\n\
  \tdefined-or\n  Built under freebsd\n  Compiled at Jun  5 2006 12:26:25\n  %ENV:\n    PERL5LIB=\"blib6/pugs/perl5/lib:blib6/pugs/perl5/arch\"\n    PERL6LIB=\"blib6/lib\"\n  @INC:\n    blib6/pugs/perl5/lib\n    blib6/pugs/perl5/arch\n    /usr/local/lib/perl5/5.8.8/BSDPAN\n    /usr/local/lib/perl5/site_perl/5.8.8/mach\n    /usr/local/lib/perl5/site_perl/5.8.8\n    /usr/local/lib/perl5/site_perl\n    /usr/local/lib/perl5/5.8.8/mach\n    /usr/local/lib/perl5/5.8.8\n    .\n"
config: 
  concurrent: 1
  exclude: 
    - Disabled,^ext\b
  exclude_re: ~
  include: []

  include_re: ~
  output-file: tests.yml
  pugs-path: perl
  recurse: 1
  shuffle: 0
  test_count: 551
revision: unknown
smoker: 
  email: clkao@cpan.org
  name: Chia-liang Kao
timing: 
  duration: 2664
  end: 1153797173
  start: 1153794509
Test file Test cases %
TOTAL 551 files 2458 test cases: 920 ok, 1538 failed, 262 todo, 61 skipped and 27 unexpectedly succeeded 37.43%
t/01-sanity/01-tap.t OK
                   
100.00%
t/01-sanity/02-counter.t OK
       
100.00%
t/01-sanity/03-equal.t OK
       
100.00%
t/01-sanity/04-if.t OK
   
100.00%
t/01-sanity/05-sub.t OK
       
100.00%
t/01-sanity/06-use.t OK
 
100.00%
t/01-sanity/07-binding.t OK
     
100.00%
t/01-sanity/07-defined.t OK
   
100.00%
t/01-sanity/07-end-blocks.t OK
   
100.00%
t/01-sanity/07-for.t OK
           
100.00%
t/01-sanity/07-isa.t OK
     
100.00%
t/01-sanity/07-range.t OK
       
100.00%
t/01-sanity/07-ref.t FAILED
     
0.00%
t/01-sanity/07-simple-multisubs.t OK
   
100.00%
t/01-sanity/07-split.t OK
       
100.00%
t/01-sanity/07-substr.t OK
 
100.00%
t/01-sanity/07-tailcall.t OK
     
100.00%
t/01-sanity/07-try.t OK
       
100.00%
t/02-test-pm/0-compile.t OK
 
100.00%
t/02-test-pm/1-basic.t FAILED
                                                                       
                                                                     
69.01%
t/02-test-pm/2-force_todo.t OK
                     
100.00%
t/02-test-pm/3-output.t SKIPPED
 
0.00%
t/Dialects/perlego/isrw.t SKIPPED
 
100.00%
t/Dialects/perlego/sigilless.t SKIPPED
 
100.00%
t/builtins/arity.t OK
         
100.00%
t/builtins/arrays/chomp.t SKIPPED
 
0.00%
t/builtins/arrays/elems.t SKIPPED
 
0.00%
t/builtins/arrays/end.t FAILED
 
0.00%
t/builtins/arrays/isa.t SKIPPED
 
0.00%
t/builtins/arrays/pop.t FAILED
 
0.00%
t/builtins/arrays/push.t FAILED
 
0.00%
t/builtins/arrays/shift.t FAILED
 
0.00%
t/builtins/arrays/slice.t FAILED
 
0.00%
t/builtins/arrays/splice.t FAILED
 
0.00%
t/builtins/arrays/unshift.t FAILED
 
0.00%
t/builtins/arrays_and_hashes/delete.t FAILED
 
0.00%
t/builtins/arrays_and_hashes/exists.t FAILED
 
0.00%
t/builtins/arrays_and_hashes/keys_values.t SKIPPED
 
0.00%
t/builtins/arrays_and_hashes/kv.t FAILED
 
0.00%
t/builtins/arrays_and_hashes/pairs.t FAILED
 
0.00%
t/builtins/arrays_and_hashes/pick.t SKIPPED
 
0.00%
t/builtins/bool/defined.t FAILED
                                         
52.38%
t/builtins/bool/not.t FAILED
                   
0.00%
t/builtins/bool/true.t FAILED
                   
30.00%
t/builtins/caller.t FAILED
 
0.00%
t/builtins/control_flow/die.t FAILED
 
0.00%
t/builtins/control_flow/die_and_end.t SKIPPED
 
0.00%
t/builtins/control_flow/die_arg_preservation.t SKIPPED
 
0.00%
t/builtins/control_flow/eval.t FAILED
 
0.00%
t/builtins/control_flow/fail.t FAILED
       
0.00%
t/builtins/control_flow/goto.t SKIPPED
 
0.00%
t/builtins/control_flow/leave.t SKIPPED
 
0.00%
t/builtins/control_flow/nothing.t FAILED
 
0.00%
t/builtins/control_flow/try.t SKIPPED
 
0.00%
t/builtins/hashes/isa.t FAILED
   
0.00%
t/builtins/hashes/slice.t FAILED
 
0.00%
t/builtins/hex.t FAILED
                                                               
0.00%
t/builtins/io/dir.t FAILED
 
0.00%
t/builtins/io/evalfile.t FAILED
 
0.00%
t/builtins/io/exit-in-if.t OK
 
100.00%
t/builtins/io/exit.t OK
 
100.00%
t/builtins/io/getc.t FAILED
 
0.00%
t/builtins/io/io.t FAILED
 
0.00%
t/builtins/io/io_edge_error_cases.t FAILED
     
33.33%
t/builtins/io/io_in_for_loops.t FAILED
 
0.00%
t/builtins/io/io_in_while_loops.t FAILED
 
0.00%
t/builtins/io/io_redirect_to_scalar.t FAILED
 
0.00%
t/builtins/io/readline_chomped.t SKIPPED
 
0.00%
t/builtins/io/say_and_print.t FAILED
                     
81.82%
t/builtins/io/sleep.t FAILED
 
0.00%
t/builtins/io/slurp.t FAILED
 
0.00%
t/builtins/io/system.t FAILED
     
0.00%
t/builtins/io/time.t FAILED
 
0.00%
t/builtins/io/unlink.t SKIPPED
 
0.00%
t/builtins/lists/empty_list_in_map.t FAILED
             
14.29%
t/builtins/lists/flattening_in_map.t FAILED
 
0.00%
t/builtins/lists/grep.t FAILED
 
0.00%
t/builtins/lists/join.t FAILED
 
0.00%
t/builtins/lists/map.t FAILED
 
0.00%
t/builtins/lists/map_function_return_values.t SKIPPED
 
0.00%
t/builtins/lists/map_with_signature.t SKIPPED
 
0.00%
t/builtins/lists/minmax.t FAILED
 
0.00%
t/builtins/lists/mutating_listops.t FAILED
 
0.00%
t/builtins/lists/one_elem_list_kv.t OK
         
100.00%
t/builtins/lists/reduce.t FAILED
 
0.00%
t/builtins/lists/reverse.t FAILED
 
0.00%
t/builtins/lists/sort.t FAILED
 
0.00%
t/builtins/lists/sum.t FAILED
 
0.00%
t/builtins/lists/topic_in_map.t FAILED
 
0.00%
t/builtins/lists/uniq.t FAILED
 
0.00%
t/builtins/lists/zip.t FAILED
 
0.00%
t/builtins/math/NaN.t FAILED
 
0.00%
t/builtins/math/abs.t SKIPPED
 
0.00%
t/builtins/math/exp.t SKIPPED
 
0.00%
t/builtins/math/infinity.t FAILED
 
0.00%
t/builtins/math/int.t FAILED
 
0.00%
t/builtins/math/log.t SKIPPED
 
0.00%
t/builtins/math/rand.t OK
                                           
100.00%
t/builtins/math/rounders.t SKIPPED
 
0.00%
t/builtins/math/sign.t FAILED
           
0.00%
t/builtins/math/sqrt.t SKIPPED
 
0.00%
t/builtins/math/trig.t SKIPPED
 
0.00%
t/builtins/my.t FAILED
                                                     
70.37%
t/builtins/numify.t FAILED
 
0.00%
t/builtins/perl.t FAILED
 
0.00%
t/builtins/perl2.t FAILED
 
0.00%
t/builtins/ref.t FAILED
 
0.00%
t/builtins/sprintf_and_as.t FAILED
 
0.00%
t/builtins/strings/append.t OK
       
100.00%
t/builtins/strings/capitalize.t FAILED
 
0.00%
t/builtins/strings/chomp.t SKIPPED
 
0.00%
t/builtins/strings/index.t FAILED
 
0.00%
t/builtins/strings/lc.t FAILED
 
0.00%
t/builtins/strings/lcfirst.t FAILED
 
0.00%
t/builtins/strings/length.t FAILED
 
0.00%
t/builtins/strings/ord_and_chr.t SKIPPED
 
0.00%
t/builtins/strings/reverse.t FAILED
 
0.00%
t/builtins/strings/rindex.t FAILED
 
0.00%
t/builtins/strings/split.t FAILED
 
0.00%
t/builtins/strings/substr.t FAILED
 
0.00%
t/builtins/strings/trans.t FAILED
 
0.00%
t/builtins/strings/uc.t FAILED
 
0.00%
t/builtins/strings/ucfirst.t SKIPPED
 
0.00%
t/builtins/system/01-strings-with-spaces.t FAILED
 
0.00%
t/builtins/system/chmod.t FAILED
 
0.00%
t/builtins/undef.t FAILED
 
0.00%
t/builtins/want.t FAILED
 
0.00%
t/data_types/anon_block.t FAILED
 
0.00%
t/data_types/arglist.t FAILED
 
0.00%
t/data_types/array.t SKIPPED
 
0.00%
t/data_types/array_extending.t SKIPPED
 
0.00%
t/data_types/array_mmd.t FAILED
 
0.00%
t/data_types/array_ref.t FAILED
                                                                                         
0.00%
t/data_types/catch_type_cast_mismatch.t SKIPPED
 
0.00%
t/data_types/enum.t FAILED
 
0.00%
t/data_types/flattening.t FAILED
 
0.00%
t/data_types/hash.t FAILED
                                                       
                                                     
25.45%
t/data_types/hash_ref.t FAILED
 
0.00%
t/data_types/lazy_lists.t FAILED
 
0.00%
t/data_types/lists.t FAILED
 
0.00%
t/data_types/mixed_multi_dimensional.t FAILED
 
0.00%
t/data_types/multi_dimensional_array.t FAILED
                                                             
61.29%
t/data_types/nested_arrays.t FAILED
               
62.50%
t/data_types/nested_pairs.t FAILED
             
0.00%
t/data_types/num.t FAILED
 
0.00%
t/data_types/pair.t FAILED
 
0.00%
t/data_types/subscripts_and_context.t FAILED
               
75.00%
t/data_types/subtypes.t FAILED
                         
46.15%
t/examples/examples.t SKIPPED
 
0.00%
t/examples/golf.t FAILED
 
0.00%
t/examples/golfex.t SKIPPED
 
0.00%
t/general/atoms.t FAILED
 
0.00%
t/general/basic.t FAILED
 
0.00%
t/general/config.t SKIPPED
 
0.00%
t/junction/abc.t FAILED
 
0.00%
t/junction/any_values_infinite_loop.t FAILED
 
0.00%
t/junction/array_deref.t OK
 
100.00%
t/junction/associative.t FAILED
 
0.00%
t/junction/chained_operators.t FAILED
 
0.00%
t/junction/junction_any_pick.t FAILED
   
0.00%
t/junction/junction_functions.t FAILED
 
0.00%
t/junction/junction_pick.t FAILED
 
0.00%
t/junction/misc_junctions.t FAILED
 
0.00%
t/junction/s09eg.t FAILED
 
0.00%
t/macros/closure_returning_macros.t SKIPPED
 
0.00%
t/macros/macro_code_test.t FAILED
 
0.00%
t/macros/opaque_ast_macros.t FAILED
 
0.00%
t/macros/operator_macros.t FAILED
 
0.00%
t/macros/string_returning_macros.t FAILED
 
0.00%
t/magicals/block.t FAILED
 
0.00%
t/magicals/caller_pos.t SKIPPED
 
0.00%
t/magicals/dollar_underscore.t FAILED
 
0.00%
t/magicals/env.t FAILED
 
0.00%
t/magicals/file_line.t SKIPPED
 
0.00%
t/magicals/inc.t SKIPPED
 
0.00%
t/magicals/line_basic.t SKIPPED
 
0.00%
t/magicals/pid.t FAILED
 
0.00%
t/magicals/progname.t SKIPPED
 
0.00%
t/magicals/sub.t FAILED
 
0.00%
t/magicals/subname.t FAILED
     
33.33%
t/oo/attributes/attribute_initializement.t FAILED
 
0.00%
t/oo/attributes/attribute_list.t FAILED
 
0.00%
t/oo/attributes/class.t OK
               
100.00%
t/oo/attributes/defaults.t SKIPPED
 
0.00%
t/oo/attributes/instance.t FAILED
 
0.00%
t/oo/attributes/is_rw_on_class.t SKIPPED
 
0.00%
t/oo/attributes/methods_on_typed_attrs.t FAILED
 
0.00%
t/oo/attributes/mutators.t FAILED
 
0.00%
t/oo/attributes/undeclared_attribute.t FAILED
 
0.00%
t/oo/can.t OK
   
100.00%
t/oo/class/anonymous.t OK
         
100.00%
t/oo/class/basic.t FAILED
 
0.00%
t/oo/class/indirect_notation.t FAILED
 
0.00%
t/oo/class/inherit_from_role.t SKIPPED
 
0.00%
t/oo/class/inheritance.t SKIPPED
 
0.00%
t/oo/class/literal.t SKIPPED
 
0.00%
t/oo/class/nested_use.t SKIPPED
 
0.00%
t/oo/clone.t FAILED
 
0.00%
t/oo/construction.t FAILED
 
0.00%
t/oo/delegation.t FAILED
 
0.00%
t/oo/destruction.t FAILED
 
0.00%
t/oo/enums.t OK
                                                         
                                                         
100.00%
t/oo/global_destruction.t SKIPPED
 
0.00%
t/oo/inheritance.t FAILED
 
0.00%
t/oo/instantiation.t FAILED
 
0.00%
t/oo/magical_vars.t FAILED
 
0.00%
t/oo/meta_class.t FAILED
                 
88.89%
t/oo/methods/both.t FAILED
       
0.00%
t/oo/methods/builtins.t FAILED
 
0.00%
t/oo/methods/chaining.t FAILED
 
0.00%
t/oo/methods/class.t FAILED
     
33.33%
t/oo/methods/instance.t FAILED
 
0.00%
t/oo/methods/multi.t FAILED
 
0.00%
t/oo/methods/not_found_fails.t FAILED
 
0.00%
t/oo/methods/overload.t FAILED
 
0.00%
t/oo/methods/ref.t FAILED
 
0.00%
t/oo/methods/topic.t FAILED
 
0.00%
t/oo/named_parameters_in_BUILD.t FAILED
 
0.00%
t/oo/object_id.t FAILED
 
0.00%
t/oo/positional_parameters_in_BUILD.t OK
 
100.00%
t/oo/precedence.t OK
   
100.00%
t/oo/proxy.t FAILED
 
0.00%
t/oo/roles/anonymous.t OK
                           
100.00%
t/oo/roles/basic.t FAILED
                                       
85.00%
t/oo/roles/conflicts.t FAILED
 
0.00%
t/oo/roles/instantiation.t SKIPPED
 
0.00%
t/oo/roles/parameterized.t OK
                                           
100.00%
t/oo/roles/properties.t OK
         
100.00%
t/oo/roles/submethods.t FAILED
 
0.00%
t/oo/roles/super.t FAILED
 
0.00%
t/oo/submethods.t FAILED
 
0.00%
t/oo/super.t FAILED
 
0.00%
t/oo/syntax-but.t FAILED
 
0.00%
t/oo/traits/basic.t FAILED
             
0.00%
t/oo/traits/parameterized.t FAILED
             
0.00%
t/oo/trusts.t FAILED
 
0.00%
t/oo/type.t FAILED
 
0.00%
t/oo/value_types.t FAILED
 
0.00%
t/operators/adverbial_modifiers.t FAILED
 
0.00%
t/operators/and_precedence.t OK
       
100.00%
t/operators/arith.t FAILED
 
0.00%
t/operators/assign.t FAILED
 
0.00%
t/operators/auto.t OK
                                                                         
100.00%
t/operators/binding/arrays.t FAILED
                                                                                           
95.65%
t/operators/binding/attributes.t FAILED
 
0.00%
t/operators/binding/hashes.t FAILED
 
0.00%
t/operators/binding/nested.t FAILED
 
0.00%
t/operators/binding/scalars.t FAILED
                                                       
25.00%
t/operators/binding/subs.t FAILED
 
0.00%
t/operators/bit.t FAILED
 
0.00%
t/operators/cond.t OK
           
100.00%
t/operators/context_forcers.t FAILED
                                                                   
82.35%
t/operators/eq.t OK
                   
100.00%
t/operators/filetest.t FAILED
 
0.00%
t/operators/flip-flop.t FAILED
 
0.00%
t/operators/hyper.t FAILED
 
0.00%
t/operators/identity.t FAILED
 
0.00%
t/operators/inc.t OK
                                                             
100.00%
t/operators/iteration.t FAILED
 
0.00%
t/operators/listquote.t FAILED
 
0.00%
t/operators/lvalue.t FAILED
 
0.00%
t/operators/negated_smartmatch.t FAILED
 
0.00%
t/operators/operator.t FAILED
 
0.00%
t/operators/operator_overloading.t FAILED
 
0.00%
t/operators/pipe.t OK
             
100.00%
t/operators/precedence.t FAILED
 
0.00%
t/operators/quoting.t FAILED
 
0.00%
t/operators/range.t FAILED
 
0.00%
t/operators/recursive_definition.t FAILED
 
0.00%
t/operators/reduce-metaop.t FAILED
 
0.00%
t/operators/relational.t OK
                                                                                   
100.00%
t/operators/repeat.t FAILED
 
0.00%
t/operators/short_circuit.t FAILED
 
0.00%
t/operators/smartmatch.t FAILED
 
0.00%
t/operators/spaceship_and_datatypes.t OK
           
100.00%
t/operators/splat.t FAILED
 
0.00%
t/operators/subscript_adverbs.t SKIPPED
 
0.00%
t/operators/ternary.t FAILED
 
0.00%
t/operators/value_equivalence.t FAILED
 
0.00%
t/packages/autoload.t FAILED
 
0.00%
t/packages/export.t FAILED
             
0.00%
t/packages/import.t SKIPPED
 
0.00%
t/packages/lexical_pragmas.t SKIPPED
 
0.00%
t/packages/reflection.t FAILED
 
0.00%
t/packages/require_and_use.t FAILED
 
0.00%
t/packages/scope.t SKIPPED
 
0.00%
t/packages/symbols.t FAILED
 
0.00%
t/packages/use_perl_6.t FAILED
 
0.00%
t/perl5/array.t FAILED
 
0.00%
t/perl5/basic.t FAILED
     
0.00%
t/perl5/class.t FAILED
 
0.00%
t/perl5/exception_handling.t FAILED
     
0.00%
t/perl5/hash.t FAILED
 
0.00%
t/perl5/import.t FAILED
 
0.00%
t/perl5/method.t FAILED
 
0.00%
t/perl5/return.t FAILED
 
0.00%
t/perl5/roundtrip.t FAILED
 
0.00%
t/pil/bindings.t SKIPPED
 
0.00%
t/pil/bit.t SKIPPED
 
0.00%
t/pil/container/array.t FAILED
 
0.00%
t/pil/container/hash.t SKIPPED
 
0.00%
t/pil/container/list.t FAILED
 
0.00%
t/pil/container/pair.t SKIPPED
 
0.00%
t/pil/container/scalar.t SKIPPED
 
0.00%
t/pil/metamodel/MRO.t FAILED
 
0.00%
t/pil/metamodel/S12_example.t FAILED
 
0.00%
t/pil/metamodel/basic_object.t FAILED
 
0.00%
t/pil/metamodel/bootstrap.t SKIPPED
 
0.00%
t/pil/metamodel/class_api.t SKIPPED
 
0.00%
t/pil/metamodel/collect_all_roles.t FAILED
 
0.00%
t/pil/metamodel/does.t FAILED
 
0.00%
t/pil/metamodel/inheritence.t FAILED
 
0.00%
t/pil/metamodel/next.t FAILED
 
0.00%
t/pil/metamodel/role_conflicts.t FAILED
 
0.00%
t/pil/metamodel/roles.t FAILED
 
0.00%
t/pil/simple.t FAILED
 
0.00%
t/rules/from_perl6_rules/anchors.t FAILED
 
0.00%
t/rules/from_perl6_rules/array_cap.t FAILED
 
0.00%
t/rules/from_perl6_rules/assert.t OK
       
100.00%
t/rules/from_perl6_rules/capture.t FAILED
                                                                 
                                                               
0.00%
t/rules/from_perl6_rules/charset.t FAILED
                                               
25.00%
t/rules/from_perl6_rules/codevars.t FAILED
                   
0.00%
t/rules/from_perl6_rules/combchar.t FAILED
     
0.00%
t/rules/from_perl6_rules/context.t OK
             
100.00%
t/rules/from_perl6_rules/counted.t FAILED
 
0.00%
t/rules/from_perl6_rules/der_grammar.t FAILED
                                                                 
0.00%
t/rules/from_perl6_rules/exhaustive.t SKIPPED
 
0.00%
t/rules/from_perl6_rules/grammar.t FAILED
 
0.00%
t/rules/from_perl6_rules/hash_cap.t FAILED
 
0.00%
t/rules/from_perl6_rules/hashkv.t FAILED
 
0.00%
t/rules/from_perl6_rules/inline.t OK
   
100.00%
t/rules/from_perl6_rules/litvar.t FAILED
 
0.00%
t/rules/from_perl6_rules/lookaround.t FAILED
                   
0.00%
t/rules/from_perl6_rules/named_cap.t FAILED
                                                   
3.85%
t/rules/from_perl6_rules/named_chars.t FAILED
 
0.00%
t/rules/from_perl6_rules/newline.t OK
                             
100.00%
t/rules/from_perl6_rules/noncap.t OK
               
100.00%
t/rules/from_perl6_rules/null.t FAILED
     
0.00%
t/rules/from_perl6_rules/overlapping.t SKIPPED
 
0.00%
t/rules/from_perl6_rules/patvar.t OK
                                     
100.00%
t/rules/from_perl6_rules/pos.t OK
                 
100.00%
t/rules/from_perl6_rules/pos_modifier.t SKIPPED
 
0.00%
t/rules/from_perl6_rules/prior.t FAILED
                                                             
9.68%
t/rules/from_perl6_rules/propcharset.t FAILED
 
0.00%
t/rules/from_perl6_rules/properties.t FAILED
 
0.00%
t/rules/from_perl6_rules/qinterp.t FAILED
 
0.00%
t/rules/from_perl6_rules/repeat.t FAILED
           
0.00%
t/rules/from_perl6_rules/rulecode.t FAILED
       
0.00%
t/rules/from_perl6_rules/stdrules.t FAILED
 
0.00%
t/rules/from_perl6_rules/subrule.t FAILED
 
0.00%
t/rules/from_perl6_rules/subst.t FAILED
 
0.00%
t/rules/from_perl6_rules/word.t FAILED
             
57.14%
t/rules/grammar.t FAILED
 
0.00%
t/rules/named_rule_capture.t FAILED
 
0.00%
t/rules/nonstrings.t SKIPPED
 
0.00%
t/rules/numbered_match_variable.t FAILED
   
0.00%
t/rules/perl5_1.t FAILED
                                                                                                   
                                                                                                   
4.00%
t/rules/perl5_2.t FAILED
                                                                                                   
                                                                                                   
8.00%
t/rules/perl5_3.t FAILED
                                                                                                   
                                                                                                   
4.00%
t/rules/perl5_4.t FAILED
                                                                                                   
                                                                                                   
0.00%
t/rules/perl5_5.t FAILED
                                                                                                   
                                                                                                   
0.00%
t/rules/perl5_6.t FAILED
                                                                                                   
                                                                                                   
0.00%
t/rules/perl5_7.t FAILED
                                                                                                   
                                                                                                   
0.00%
t/rules/perl5_8.t FAILED
                                                                                                   
                                                                                                   
0.00%
t/rules/perl5_9.t FAILED
                                                                                 
                                                                                 
0.00%
t/rules/rules.t FAILED
 
0.00%
t/rules/rules_refs.t FAILED
     
66.67%
t/rules/rx_perl5_escape.t OK
 
100.00%
t/rules/rx_perl5_g.t FAILED
       
25.00%
t/rules/rx_perl5_match.t FAILED
 
0.00%
t/rules/s_perl5.t FAILED
 
0.00%
t/rules/variable_interpolation.t FAILED
 
0.00%
t/run/01-dash-uppercase-i.t SKIPPED
 
0.00%
t/run/01-multiple-e.t FAILED
 
0.00%
t/run/02-dash-n.t FAILED
 
0.00%
t/run/03-dash-p.t FAILED
 
0.00%
t/run/04-dash-ce.t SKIPPED
 
0.00%
t/run/05-unknown-option.t FAILED
 
0.00%
t/run/06-dash-help.t FAILED
 
0.00%
t/run/06-dash-version.t FAILED
 
0.00%
t/run/07-dash-uppercase-v.t SKIPPED
 
0.00%
t/run/08-script-from-stdin.t FAILED
 
0.00%
t/run/09-dash-uppercase-c.t SKIPPED
 
0.00%
t/run/10-dash-uppercase-m.t SKIPPED
 
0.00%
t/run/11-safemode.t FAILED
 
0.00%
t/run/12-script-args.t SKIPPED
 
0.00%
t/statements/array_values_in_bool_context.t OK
                                         
100.00%
t/statements/check.t FAILED
               
62.50%
t/statements/control_blocks.t FAILED
                                       
10.00%
t/statements/do.t FAILED
     
0.00%
t/statements/exit_in_begin.t OK
   
100.00%
t/statements/exit_in_check.t FAILED
   
50.00%
t/statements/first.t FAILED
 
0.00%
t/statements/for.t FAILED
 
0.00%
t/statements/for_with_only_one_item.t OK
               
100.00%
t/statements/gather.t FAILED
 
0.00%
t/statements/given.t FAILED
 
0.00%
t/statements/grep-and-sort-in-for.t FAILED
     
33.33%
t/statements/if.t SKIPPED
 
0.00%
t/statements/init.t FAILED
               
50.00%
t/statements/io_leaking_into_runtime.t FAILED
 
0.00%
t/statements/last.t OK
             
100.00%
t/statements/loop.t FAILED
 
0.00%
t/statements/map-and-sort-in-for.t FAILED
     
33.33%
t/statements/next.t FAILED
 
0.00%
t/statements/redo.t FAILED
 
0.00%
t/statements/return.t FAILED
           
33.33%
t/statements/return_from_inner_block.t OK
 
100.00%
t/statements/statement_modifiers.t FAILED
 
0.00%
t/statements/unless.t FAILED
                           
78.57%
t/statements/until.t OK
       
100.00%
t/statements/while.t OK
                     
100.00%
t/subroutines/arg_ref_type_preservation.t SKIPPED
 
0.00%
t/subroutines/bare_block_with_dollar_underscore.t OK
 
100.00%
t/subroutines/closure.t FAILED
 
0.00%
t/subroutines/code_blocks_as_sub_args.t FAILED
   
0.00%
t/subroutines/currying.t FAILED
 
0.00%
t/subroutines/defaults.t OK
   
100.00%
t/subroutines/dollar_underscore.t SKIPPED
 
0.00%
t/subroutines/implicit_parameters.t FAILED
 
0.00%
t/subroutines/lexical_subs.t FAILED
 
0.00%
t/subroutines/loopscope.t FAILED
 
0.00%
t/subroutines/lvalue_subroutines.t FAILED
 
0.00%
t/subroutines/multi_sub.t SKIPPED
 
0.00%
t/subroutines/multidimensional_arglists.t SKIPPED
 
0.00%
t/subroutines/nested_named.t OK
     
100.00%
t/subroutines/pointy.t FAILED
 
0.00%
t/subroutines/primitive_named_params.t OK
 
100.00%
t/subroutines/recurse.t FAILED
 
0.00%
t/subroutines/return_with_trailing_stuff.t FAILED
   
0.00%
t/subroutines/signature_matching.t FAILED
                                                   
76.92%
t/subroutines/slurpy_code_param.t FAILED
 
0.00%
t/subroutines/slurpy_param.t FAILED
 
0.00%
t/subroutines/splat_rw.t OK
     
100.00%
t/subroutines/splatty_in_caller_position.t OK
       
100.00%
t/subroutines/splatty_with_type.t OK
 
100.00%
t/subroutines/sub_arg_errors.t OK
   
100.00%
t/subroutines/sub_bug.t FAILED
 
0.00%
t/subroutines/sub_named_params.t FAILED
 
0.00%
t/subroutines/sub_parameter_traits.t FAILED
                       
66.67%
t/subroutines/sub_ref.t FAILED
 
0.00%
t/subroutines/sub_return_object_method_call.t FAILED
                   
10.00%
t/subroutines/sub_return_values.t FAILED
 
0.00%
t/subroutines/subroutine.t FAILED
 
0.00%
t/subroutines/unhashify.t SKIPPED
 
0.00%
t/subroutines/wrap.t FAILED
 
0.00%
t/syntax/POD.t OK
           
100.00%
t/syntax/begin_in_strings.t FAILED
 
0.00%
t/syntax/comments.t SKIPPED
 
0.00%
t/syntax/decl_vs_assign_prec.t FAILED
 
0.00%
t/syntax/force_context.t SKIPPED
 
0.00%
t/syntax/hexadecimal.t SKIPPED
 
0.00%
t/syntax/hyper_latin1.t FAILED
 
0.00%
t/syntax/inplace.t SKIPPED
 
0.00%
t/syntax/interpolation/arrays.t SKIPPED
 
0.00%
t/syntax/interpolation/hash_access.t FAILED
       
0.00%
t/syntax/interpolation/strings.t FAILED
 
0.00%
t/syntax/lf_in_list.t FAILED
     
66.67%
t/syntax/list_quote_junction.t FAILED
 
0.00%
t/syntax/list_quote_whitespace.t SKIPPED
 
0.00%
t/syntax/long_dot.t FAILED
 
0.00%
t/syntax/pairs.t FAILED
 
0.00%
t/syntax/parsing/braces_in_rules.t OK
 
100.00%
t/syntax/parsing/braces_in_strings.t FAILED
           
0.00%
t/syntax/parsing/gt.t FAILED
                 
44.44%
t/syntax/parsing/hash_sub.t FAILED
 
0.00%
t/syntax/parsing/nested_hashrefs.t FAILED
 
0.00%
t/syntax/parsing/numbers.t FAILED
 
0.00%
t/syntax/parsing/parens.t OK
 
100.00%
t/syntax/parsing/postfix_if_and_is.t OK
 
100.00%
t/syntax/parsing/spaceship.t FAILED
         
0.00%
t/syntax/parsing/sub_calls.t FAILED
 
0.00%
t/syntax/parsing/subscript.t FAILED
     
66.67%
t/syntax/single_quoted_strings.t OK
 
100.00%
t/syntax/stmt_or_expr.t OK
   
100.00%
t/syntax/symbol_table.t FAILED
 
0.00%
t/syntax/unicode.t FAILED
 
0.00%
t/syntax/varnames.t FAILED
       
50.00%
t/types/variables.t FAILED
 
0.00%
t/unspecced/assignment.t FAILED
 
0.00%
t/unspecced/async-sleep.t SKIPPED
 
0.00%
t/unspecced/async.t FAILED
 
0.00%
t/unspecced/chop.t FAILED
 
0.00%
t/unspecced/config.t SKIPPED
 
0.00%
t/unspecced/connect.t SKIPPED
 
0.00%
t/unspecced/cont.t FAILED
 
0.00%
t/unspecced/coro.t FAILED
 
0.00%
t/unspecced/cwd.t SKIPPED
 
0.00%
t/unspecced/eval_haskell.t SKIPPED
 
0.00%
t/unspecced/eval_yaml.t SKIPPED
 
0.00%
t/unspecced/evaluation_order.t FAILED
 
0.00%
t/unspecced/p5/export.t FAILED
 
0.00%
t/unspecced/siglist.t FAILED
 
0.00%
t/unspecced/sub_application.t SKIPPED
 
0.00%
t/unspecced/times.t FAILED
 
0.00%
t/var/assigning_refs.t FAILED
                                   
50.00%
t/var/autoderef.t FAILED
 
0.00%
t/var/autoref.t FAILED
 
0.00%
t/var/autovivification.t SKIPPED
 
0.00%
t/var/caller.t FAILED
 
0.00%
t/var/chained.t SKIPPED
 
0.00%
t/var/codevars_should_not_autovivify.t FAILED
 
0.00%
t/var/constant.t OK
                         
100.00%
t/var/default_scalar.t FAILED
 
0.00%
t/var/is_copy.t FAILED
     
33.33%
t/var/is_readonly.t FAILED
 
0.00%
t/var/is_rw.t FAILED
 
0.00%
t/var/lazy.t FAILED
                             
0.00%
t/var/let.t FAILED
                     
0.00%
t/var/lvalue_deep_brackets.t SKIPPED
 
0.00%
t/var/my.t FAILED
 
0.00%
t/var/passing_the_pair_class_to_a_sub.t OK
   
100.00%
t/var/refs_point_to_containers.t FAILED
 
0.00%
t/var/state.t FAILED
 
0.00%
t/var/symbolic_deref.t FAILED
 
0.00%
t/var/temp.t FAILED
 
0.00%
t/var/type.t FAILED
 
0.00%
t/var/var.t SKIPPED
 
0.00%
t/xx-uncategorized/arity-of-blocks-with-placeholders.t FAILED
 
0.00%
t/xx-uncategorized/assuming_and_mmd.t FAILED
 
0.00%
t/xx-uncategorized/attribute_hash.t FAILED
 
0.00%
t/xx-uncategorized/attribute_of_return_value.t FAILED
     
0.00%
t/xx-uncategorized/cast_undef_shortcircuit.t OK
   
100.00%
t/xx-uncategorized/class_inclusion_with_inherited_class.t FAILED
 
0.00%
t/xx-uncategorized/class_inheritance_become_infinite_loop.t OK
 
100.00%
t/xx-uncategorized/class_name_and_attribute_name_confliction.t OK
     
100.00%
t/xx-uncategorized/deref_doesnt.t FAILED
 
0.00%
t/xx-uncategorized/global_subst_with_lookbehind.t FAILED
 
0.00%
t/xx-uncategorized/hyperop.t FAILED
 
0.00%
t/xx-uncategorized/io_close_with_scope.t SKIPPED
 
0.00%
t/xx-uncategorized/io_finalize_part1.t SKIPPED
 
0.00%
t/xx-uncategorized/io_finalize_part2.t FAILED
       
0.00%
t/xx-uncategorized/is_copy_ne_is_rw.t OK
             
100.00%
t/xx-uncategorized/lexical-array-in-inner-block.t FAILED
   
0.00%
t/xx-uncategorized/named_2_positional.t OK
   
100.00%
t/xx-uncategorized/namespaces.t SKIPPED
 
0.00%
t/xx-uncategorized/optional_copy.t OK
 
100.00%
t/xx-uncategorized/pair_boolean.t FAILED
           
66.67%
t/xx-uncategorized/parsing_bool.t OK
       
100.00%
t/xx-uncategorized/passing-arrays-to-functions.t FAILED
 
0.00%
t/xx-uncategorized/return_in_anonymous_subs.t FAILED
 
0.00%
t/xx-uncategorized/rule_used_in_Str.t FAILED
     
0.00%
t/xx-uncategorized/rules_with_embedded_parrot.t FAILED
 
0.00%
t/xx-uncategorized/self_inheritance.t FAILED
   
0.00%
t/xx-uncategorized/shift-from-function-array-arg.t OK
 
100.00%
t/xx-uncategorized/short_circuiting.t FAILED
       
0.00%
t/xx-uncategorized/slow-parse-fail.t FAILED
 
0.00%
t/xx-uncategorized/smartmatch_autovivifies.t OK
     
100.00%
t/xx-uncategorized/smartmatch_rx_obstacle.t FAILED
 
0.00%
t/xx-uncategorized/unicode.t FAILED
       
25.00%
t/xx-uncategorized/value_alias_readonly.t SKIPPED
 
0.00%